brief Build Log for tree: MASTER
Created at: Sun Jul 29 04:50
Show full Log
Return to the MASTER Status Page

Build Data

tinderbox: administrator: thb@documentfoundation.org
tinderbox: brief-log: 1532832601.8628.html
tinderbox: brieflog: https://tinderbox.libreoffice.org/cgi-bin/gunzip.cgi?tree=MASTER&brief-log=1532832601.8628
tinderbox: buildname: Win-x86_64_42
tinderbox: errorparser: unix
tinderbox: errors: 24
tinderbox: full-log: 1532832601.8628.html
tinderbox: fulllog: https://tinderbox.libreoffice.org/cgi-bin/gunzip.cgi?tree=MASTER&full-log=1532832601.8628
tinderbox: print: &nbsp; <a href=´http://cgit.freedesktop.org/libreoffice/core/log/?id=c97df0d704bfa5eebe573386445abfa4dcfd95b8´>core</a>
tinderbox: starttime: 1532827650
tinderbox: status: build_failed
tinderbox: timenow: 1532831854
tinderbox: tree: MASTER

Pick an error message to see Log

End of Log File
configure: WARNING: --without-ucrt-dir not specified or MSUs not found - installer will have runtime dependency
* WARNING : --without-ucrt-dir not specified or MSUs not found - installer will have runtime dependency
a00521:116: warning: explicit link request to ´com::sun::star::uno::Sequence< E >´ could not be resolved
warning: tag INPUT: input source `/cygdrive/d/lode/dev/core/udkapi/org´ does not exist
0 new fatal (5 suppressed by D:/lode/dev/core/solenv/sanitizers/ui/modules/schart.suppr)
0 new fatal (12 suppressed by D:/lode/dev/core/solenv/sanitizers/ui/dbaccess.suppr)
0 new fatal (1 suppressed by D:/lode/dev/core/solenv/sanitizers/ui/modules/scanner.suppr)
0 new fatal (27 suppressed by D:/lode/dev/core/solenv/sanitizers/ui/cui.suppr)
0 new fatal (4 suppressed by D:/lode/dev/core/solenv/sanitizers/ui/formula.suppr)
0 new fatal (2 suppressed by D:/lode/dev/core/solenv/sanitizers/ui/fps.suppr)
0 new fatal (2 suppressed by D:/lode/dev/core/solenv/sanitizers/ui/modules/dbreport.suppr)
0 new fatal (1 suppressed by D:/lode/dev/core/solenv/sanitizers/ui/svt.suppr)
0 new error (17 suppressed by D:/lode/dev/core/solenv/sanitizers/ui/svx.suppr)
0 new fatal (19 suppressed by D:/lode/dev/core/solenv/sanitizers/ui/svx.suppr)
0 new fatal (2 suppressed by D:/lode/dev/core/solenv/sanitizers/ui/vcl.suppr)
0 new error (3 suppressed by D:/lode/dev/core/solenv/sanitizers/ui/modules/simpress.suppr)
0 new fatal (5 suppressed by D:/lode/dev/core/solenv/sanitizers/ui/modules/simpress.suppr)
0 new error (23 suppressed by D:/lode/dev/core/solenv/sanitizers/ui/modules/scalc.suppr)
0 new fatal (23 suppressed by D:/lode/dev/core/solenv/sanitizers/ui/modules/scalc.suppr)
0 new error (8 suppressed by D:/lode/dev/core/solenv/sanitizers/ui/modules/swriter.suppr)
0 new fatal (40 suppressed by D:/lode/dev/core/solenv/sanitizers/ui/modules/swriter.suppr)
D:/lode/dev/core/sw/source/filter/ww8/ww8scan.cxx(8445): error C2220: warning treated as error - no ´object´ file generated
make[1]: *** [D:/lode/dev/core/solenv/gbuild/LinkTarget.mk:293: D:/lode/dev/core/workdir/CxxObject/sw/source/filter/ww8/ww8scan.o] Error 2
make: *** [Makefile:286: build] Error 2



Build Log




 Skipping 68 Lines...

74            checking whether to enable pch feature... yes
75            checking the GNU Make version... D:/lode/opt/bin/make 4.2.1
76            checking whether GNU Make supports the ´file´ function... yes
77            checking for --hash-style gcc linker support... no 
78            checking for perl... /usr/bin/perl
79            checking the Perl version... Perl 5
80            checking for required Perl modules... all modules found
81            checking for Windows SDK... found Windows SDK 10.0 (/cygdrive/c/PROGRA~2/WINDOW~3/10)
82            checking for midl.exe... C:\Program Files (x86)\Windows Kits\10\/Bin/10.0.17134.0/x64/midl.exe
83            checking for csc.exe... C:\Windows\Microsoft.NET\Framework\v4.0.30319\/csc.exe
84            checking for al.exe... C:\Program Files\Microsoft SDKs\Windows\v7.1\Bin\NETFX 4.0 Tools\/al.exe
85            checking .NET Framework... found: C:/PROGRA~2/WINDOW~3/NETFXSDK/46D346~1.1/
86            checking whether to enable runtime optimizations... yes
87            checking valgrind/valgrind.h usability... no
88            checking valgrind/valgrind.h presence... no
89            checking for valgrind/valgrind.h... no
90            checking sys/sdt.h usability... no
91            checking sys/sdt.h presence... no
92            checking for sys/sdt.h... no
93            checking What the C++ library is... Microsoft
94            checking for gperf... /usr/bin/gperf
95            checking gperf version... OK
96            checking which libcmis to use... internal
97            checking whether C:/PROGRA~2/MIB055~1/2017/COMMUN~1/VC/Tools/MSVC/1414~1.264/bin/HostX64/x64/cl.exe supports C++11... yes
98            checking whether C:/PROGRA~2/MIB055~1/2017/COMMUN~1/VC/Tools/MSVC/1414~1.264/bin/HostX64/x64/cl.exe supports C++11 without Language Defect 757... yes
99            checking whether C:/PROGRA~2/MIB055~1/2017/COMMUN~1/VC/Tools/MSVC/1414~1.264/bin/HostX64/x64/cl.exe supports C++14 constexpr... yes
100           checking whether C:/PROGRA~2/MIB055~1/2017/COMMUN~1/VC/Tools/MSVC/1414~1.264/bin/HostX64/x64/cl.exe supports guaranteed copy elision... no
101           checking which memory allocator to use... internal
102           checking for posix_fallocate... no
103           checking whether to add custom build version... no
104           checking for C:/PROGRA~2/MIB055~1/2017/COMMUN~1/VC/redist/MSVC/14.14.26405/x64/Microsoft.VC141.CRT... checking for Microsoft_VC141_CRT_x86.msm Microsoft_VC150_CRT_x86.msm... checking for C:/PROGRA~2/MIB055~1/2017/COMMUN~1/VC/redist/MSVC/14.14.26405/MergeModules... C:/PROGRA~2/MIB055~1/2017/COMMUN~1/VC/redist/MSVC/14.14.26405/MergeModules/
105   NEXT    configure: WARNING: --without-ucrt-dir not specified or MSUs not found - installer will have runtime dependency
106           checking the installed JDK... checked (JDK 1.7.0_75)
107           checking for JAWT lib... jawt.lib
108           checking whether to enable export file validation... no, as Java is too old, need Java 8
109           checking for Microsoft Binary File Format Validator... no
110           checking which C preprocessor to use in idlc... ucpp

 Skipping 232 Lines...

342           config.status: creating config_host/config_options.h
343           config.status: config_host/config_options.h is unchanged
344           config.status: creating config_host/config_options_calc.h
345           config.status: config_host/config_options_calc.h is unchanged
346           config.status: creating config_host/config_typesizes.h
347           config.status: creating config_host/config_vendor.h
348           config.status: config_host/config_vendor.h is unchanged
349           config.status: creating config_host/config_vcl.h
350           config.status: config_host/config_vcl.h is unchanged
351           config.status: creating config_host/config_vclplug.h
352           config.status: config_host/config_vclplug.h is unchanged
353           config.status: creating config_host/config_version.h
354           config.status: config_host/config_version.h is unchanged
355           config.status: creating config_host/config_oauth2.h
356           config.status: config_host/config_oauth2.h is unchanged
357           config.status: creating config_host/config_poppler.h
358           config.status: config_host/config_poppler.h is unchanged
359           config.status: creating config_host/config_python.h
360           config.status: config_host/config_python.h is unchanged
361           config.status: creating config_host/config_writerperfect.h
362           config.status: config_host/config_writerperfect.h is unchanged
363           Language Configuration unchanged - avoiding scp2 stamp update
364           ****************************************************************************
365           
366           To build, run:
367           D:/lode/opt/bin/make
368           
369           To view some help, run:
370           D:/lode/opt/bin/make help
371           
372           *************************************
373   NEXT    * WARNING : --without-ucrt-dir not specified or MSUs not found - installer will have runtime dependency
374           [build C  ] solenv/bin/concat-deps.c
375           [build CXX] soltools/mkdepend/collectdircontent.cxx
376           [build C  ] soltools/mkdepend/cppsetup.c
377           [build C  ] soltools/mkdepend/ifparser.c
378           [build C  ] soltools/mkdepend/include.c

 Skipping 3254 Lines...

3632          [build CXX] sal/rtl/uuid.cxx
3633          [build CXX] sal/textenc/converter.cxx
3634          [build CXX] sal/textenc/convertsimple.cxx
3635          [build CXX] sal/textenc/handleundefinedunicodetotextchar.cxx
3636          [build CXX] sal/textenc/tcvtutf8.cxx
3637          [build CXX] sal/textenc/tencinfo.cxx
3638          [build CXX] sal/textenc/textcvt.cxx
3639          [build CXX] sal/textenc/textenc.cxx
3640          [build CXX] sal/textenc/unichars.cxx
3641          [build CXX] sal/osl/w32/backtrace.cxx
3642          [build CXX] sal/osl/w32/conditn.cxx
3643          [build CXX] sal/osl/w32/dllentry.cxx
3644          [build CXX] sal/osl/w32/file.cxx
3645          [build CXX] sal/osl/w32/file_dirvol.cxx
3646          [build CXX] sal/osl/w32/file_error.cxx
3647          [build CXX] sal/osl/w32/file_url.cxx
3648          [build CXX] sal/osl/w32/interlck.cxx
3649          [build CXX] sal/osl/w32/memory.cxx
3650          [build CXX] sal/osl/w32/module.cxx
3651          [build CXX] sal/osl/w32/mutex.cxx
3652          [build CXX] sal/osl/w32/nlsupport.cxx
3653          [build CXX] sal/osl/w32/path_helper.cxx
3654          [build CXX] sal/osl/w32/pipe.cxx
3655          [build CXX] sal/osl/w32/process.cxx
3656          [build CXX] sal/osl/w32/procimpl.cxx
3657          [build CXX] sal/osl/w32/profile.cxx
3658          [build CXX] sal/osl/w32/random.cxx
3659          [build CXX] sal/osl/w32/salinit.cxx
3660          [build CXX] sal/osl/w32/security.cxx
3661          [build CXX] sal/osl/w32/signal.cxx
3662          [build CXX] sal/osl/w32/socket.cxx
3663  NEXT    a00521:116: warning: explicit link request to ´com::sun::star::uno::Sequence< E >´ could not be resolved
3664          [build CXX] sal/osl/w32/tempfile.cxx
3665          [build CXX] sal/osl/w32/thread.cxx
3666          [build CXX] sal/osl/w32/time.cxx
3667          [build PAT] icu
3668          [build C  ] UnpackedTarball/zlib/adler32.c

 Skipping 3642 Lines...

7310          [build LNK] Library/so_activex.dll
7311          [build BIN] harfbuzz
7312             Creating library D:/lode/dev/core/workdir/LinkTarget/Library/iso_activex.lib and object D:/lode/dev/core/workdir/LinkTarget/Library/iso_activex.exp
7313          [build BIN] libcdr
7314          [build MOD] libfreehand
7315          [build MOD] libgpg-error
7316          [build BIN] libmspub
7317          [build BIN] libqxp
7318          [build EPK] libxml2
7319          [build BIN] libzmf
7320          [build BIN] openssl
7321          [build DEP] LNK:StaticLibrary/ulingu.lib
7322          [build LNK] StaticLibrary/ulingu.lib
7323          [build CXX] shell/source/backends/wininetbe/wininetbackend.cxx
7324          [build CXX] shell/source/backends/wininetbe/wininetbecdef.cxx
7325          [build DEP] LNK:StaticLibrary/vclmain.lib
7326          [build LNK] StaticLibrary/vclmain.lib
7327          [build CXX] i18npool/source/localedata/LocaleNode.cxx
7328          [build CXX] i18npool/source/localedata/filewriter.cxx
7329          [build CXX] i18npool/source/localedata/saxparser.cxx
7330          [build CXX] workdir/CustomTarget/i18npool/textconversion/hhc_char.cxx
7331          [build CXX] workdir/CustomTarget/i18npool/textconversion/stc_char.cxx
7332          [build CXX] workdir/CustomTarget/i18npool/textconversion/stc_word.cxx
7333          [build CXX] javaunohelper/source/bootstrap.cxx
7334          [build CXX] javaunohelper/source/javaunohelper.cxx
7335          [build CXX] javaunohelper/source/vm.cxx
7336          [build GEN] CustomTarget/odk/docs/idl/doxygen.log
7337          [build MOD] offapi
7338          [build BIN] oovbaapi
7339          [build VAL] CustomTarget/sfx2/classification/example.validated
7340          [build CXX] testtools/source/bridgetest/currentcontextchecker.cxx
7341  NEXT    warning: tag INPUT: input source `/cygdrive/d/lode/dev/core/udkapi/org´ does not exist
7342          [build CXX] testtools/source/bridgetest/multi.cxx
7343          [build CXX] testtools/source/bridgetest/constructors.cxx
7344          [build CXX] unotest/source/cpp/unoexceptionprotector/unoexceptionprotector.cxx
7345          [build BIN] xmlreader
7346          [build CXX] binaryurp/qa/test-unmarshal.cxx

 Skipping 6324 Lines...

13670         D:/lode/dev/core/workdir/UnpackedTarball/rasqal/src\rasqal.h(1835): warning C4115: ´timeval´: named type definition in parentheses
13671         D:/lode/dev/core/workdir/UnpackedTarball/rasqal/src\rasqal.h(1835): warning C4115: ´timeval´: named type definition in parentheses
13672         [build PAT] gpgmepp
13673         D:/lode/dev/core/workdir/UnpackedTarball/rasqal/src\rasqal.h(1835): warning C4115: ´timeval´: named type definition in parentheses
13674         D:/lode/dev/core/workdir/UnpackedTarball/rasqal/src\rasqal.h(1835): warning C4115: ´timeval´: named type definition in parentheses
13675         D:/lode/dev/core/workdir/UnpackedTarball/rasqal/src\rasqal.h(1835): warning C4115: ´timeval´: named type definition in parentheses
13676            Creating library D:/lode/dev/core/workdir/LinkTarget/CppunitTest/itest_officecfg_cppheader_test.lib and object D:/lode/dev/core/workdir/LinkTarget/CppunitTest/itest_officecfg_cppheader_test.exp
13677         [build MOD] libassuan
13678         [build PAT] libebook
13679         [build PKG] liblangtag_data
13680         [build DEP] LNK:Library/librdf.dll
13681         [build LNK] Library/librdf.dll
13682         [build XCD] registry_en-US
13683         [build LOC] extras
13684         [build MOD] officecfg
13685         [build MOD] readlicense_oo
13686         [build MOD] wizards
13687         [build PKG] python3
13688         [build EPK] liblangtag_data
13689         [build CXX] i18nlangtag/source/isolang/insys.cxx
13690         [build CXX] i18nlangtag/source/isolang/isolang.cxx
13691         [build CXX] i18nlangtag/source/isolang/mslangid.cxx
13692         [build CXX] i18nlangtag/source/languagetag/languagetag.cxx
13693         [build CXX] i18nlangtag/source/languagetag/languagetagicu.cxx
13694         [build UIA] modules/BasicIDE
13695         [build UIA] modules/schart
13696            Creating library D:/lode/dev/core/workdir/LinkTarget/Library/librdf.lib and object D:/lode/dev/core/workdir/LinkTarget/Library/librdf.exp
13697         [build UIA] cui
13698         0 new warning (8 suppressed by D:/lode/dev/core/solenv/sanitizers/ui/modules/BasicIDE.suppr)
13699         [build UIA] dbaccess
13700         0 new warning (83 suppressed by D:/lode/dev/core/solenv/sanitizers/ui/modules/schart.suppr)
13701 NEXT    0 new fatal (5 suppressed by D:/lode/dev/core/solenv/sanitizers/ui/modules/schart.suppr)
13702         [build UIA] modules/dbapp
13703         0 new warning (138 suppressed by D:/lode/dev/core/solenv/sanitizers/ui/dbaccess.suppr)
13704 NEXT    0 new fatal (12 suppressed by D:/lode/dev/core/solenv/sanitizers/ui/dbaccess.suppr)
13705         [build UIA] modules/dbbrowser
13706         [build UIA] modules/dbquery
13707         [build UIA] modules/dbrelation
13708         [build UIA] modules/dbtable
13709         [build UIA] modules/dbtdata
13710         [build UIA] desktop
13711         [build UIA] editeng
13712         [build UIA] modules/sabpilot
13713         [build UIA] modules/scanner
13714         [build UIA] modules/sbibliography
13715         [build UIA] modules/spropctrlr
13716         0 new warning (23 suppressed by D:/lode/dev/core/solenv/sanitizers/ui/desktop.suppr)
13717         [build UIA] filter
13718         0 new warning (43 suppressed by D:/lode/dev/core/solenv/sanitizers/ui/modules/sabpilot.suppr)
13719         0 new warning (10 suppressed by D:/lode/dev/core/solenv/sanitizers/ui/modules/scanner.suppr)
13720 NEXT    0 new fatal (1 suppressed by D:/lode/dev/core/solenv/sanitizers/ui/modules/scanner.suppr)
13721         [build UIA] formula
13722         0 new warning (3 suppressed by D:/lode/dev/core/solenv/sanitizers/ui/modules/spropctrlr.suppr)
13723         [build UIA] fps
13724         0 new warning (37 suppressed by D:/lode/dev/core/solenv/sanitizers/ui/modules/sbibliography.suppr)
13725         0 new warning (521 suppressed by D:/lode/dev/core/solenv/sanitizers/ui/cui.suppr)
13726 NEXT    0 new fatal (27 suppressed by D:/lode/dev/core/solenv/sanitizers/ui/cui.suppr)
13727         0 new warning (27 suppressed by D:/lode/dev/core/solenv/sanitizers/ui/filter.suppr)
13728         [build UIA] modules/StartModule
13729         0 new warning (17 suppressed by D:/lode/dev/core/solenv/sanitizers/ui/formula.suppr)
13730 NEXT    0 new fatal (4 suppressed by D:/lode/dev/core/solenv/sanitizers/ui/formula.suppr)
13731         [build UIA] modules/dbreport
13732         [build UIA] modules/scalc
13733         0 new warning (11 suppressed by D:/lode/dev/core/solenv/sanitizers/ui/fps.suppr)
13734 NEXT    0 new fatal (2 suppressed by D:/lode/dev/core/solenv/sanitizers/ui/fps.suppr)
13735         [build UIA] modules/sdraw
13736         [build UIA] modules/simpress
13737         [build UIA] sfx
13738         0 new warning (12 suppressed by D:/lode/dev/core/solenv/sanitizers/ui/modules/dbreport.suppr)
13739 NEXT    0 new fatal (2 suppressed by D:/lode/dev/core/solenv/sanitizers/ui/modules/dbreport.suppr)
13740         [build UIA] modules/smath
13741         [build UIA] svt
13742         0 new warning (10 suppressed by D:/lode/dev/core/solenv/sanitizers/ui/modules/sdraw.suppr)
13743         [build UIA] svx
13744         0 new warning (90 suppressed by D:/lode/dev/core/solenv/sanitizers/ui/sfx.suppr)
13745         [build UIA] modules/sglobal
13746         0 new warning (41 suppressed by D:/lode/dev/core/solenv/sanitizers/ui/modules/smath.suppr)
13747         0 new warning (27 suppressed by D:/lode/dev/core/solenv/sanitizers/ui/svt.suppr)
13748 NEXT    0 new fatal (1 suppressed by D:/lode/dev/core/solenv/sanitizers/ui/svt.suppr)
13749         [build UIA] modules/sweb
13750         [build UIA] modules/swform
13751         [build UIA] modules/swreport
13752         [build UIA] modules/swriter
13753         [build UIA] modules/swxform
13754         [build UIA] uui
13755         [build UIA] vcl
13756         [build UIA] writerperfect
13757         0 new warning (20 suppressed by D:/lode/dev/core/solenv/sanitizers/ui/uui.suppr)
13758         [build UIA] xmlsec
13759 NEXT    0 new error (17 suppressed by D:/lode/dev/core/solenv/sanitizers/ui/svx.suppr)
13760         0 new warning (149 suppressed by D:/lode/dev/core/solenv/sanitizers/ui/svx.suppr)
13761 NEXT    0 new fatal (19 suppressed by D:/lode/dev/core/solenv/sanitizers/ui/svx.suppr)
13762         0 new warning (2 suppressed by D:/lode/dev/core/solenv/sanitizers/ui/writerperfect.suppr)
13763         [build VAL] CustomTarget/writerfilter/source/ooxml/model.validated
13764         [build CXX] workdir/UnpackedTarball/libetonyek/src/lib/EtonyekDocument.cpp
13765         0 new warning (63 suppressed by D:/lode/dev/core/solenv/sanitizers/ui/xmlsec.suppr)
13766         [build CXX] workdir/UnpackedTarball/libetonyek/src/lib/IWAField.cpp
13767         0 new warning (53 suppressed by D:/lode/dev/core/solenv/sanitizers/ui/vcl.suppr)
13768 NEXT    0 new fatal (2 suppressed by D:/lode/dev/core/solenv/sanitizers/ui/vcl.suppr)
13769         [build CXX] workdir/UnpackedTarball/libetonyek/src/lib/IWAMessage.cpp
13770         [build CXX] workdir/UnpackedTarball/libetonyek/src/lib/IWAObjectIndex.cpp
13771 NEXT    0 new error (3 suppressed by D:/lode/dev/core/solenv/sanitizers/ui/modules/simpress.suppr)
13772         0 new warning (70 suppressed by D:/lode/dev/core/solenv/sanitizers/ui/modules/simpress.suppr)
13773 NEXT    0 new fatal (5 suppressed by D:/lode/dev/core/solenv/sanitizers/ui/modules/simpress.suppr)
13774         [build CXX] workdir/UnpackedTarball/libetonyek/src/lib/IWAParser.cpp
13775         Info: Boost.Config is older than your compiler version - probably nothing bad will happen - but you may wish to look for an update Boost version.  Define BOOST_CONFIG_SUPPRESS_OUTDATED_MESSAGE to suppress this message.
13776         Info: Boost.Config is older than your compiler version - probably nothing bad will happen - but you may wish to look for an update Boost version.  Define BOOST_CONFIG_SUPPRESS_OUTDATED_MESSAGE to suppress this message.
13777         Info: Boost.Config is older than your compiler version - probably nothing bad will happen - but you may wish to look for an update Boost version.  Define BOOST_CONFIG_SUPPRESS_OUTDATED_MESSAGE to suppress this message.
13778         [build CXX] workdir/UnpackedTarball/libetonyek/src/lib/IWAReader.cpp
13779 NEXT    0 new error (23 suppressed by D:/lode/dev/core/solenv/sanitizers/ui/modules/scalc.suppr)
13780         0 new warning (238 suppressed by D:/lode/dev/core/solenv/sanitizers/ui/modules/scalc.suppr)
13781 NEXT    0 new fatal (23 suppressed by D:/lode/dev/core/solenv/sanitizers/ui/modules/scalc.suppr)
13782         [build CXX] workdir/UnpackedTarball/libetonyek/src/lib/IWASnappyStream.cpp
13783         Info: Boost.Config is older than your compiler version - probably nothing bad will happen - but you may wish to look for an update Boost version.  Define BOOST_CONFIG_SUPPRESS_OUTDATED_MESSAGE to suppress this message.
13784         Info: Boost.Config is older than your compiler version - probably nothing bad will happen - but you may wish to look for an update Boost version.  Define BOOST_CONFIG_SUPPRESS_OUTDATED_MESSAGE to suppress this message.
13785         Info: Boost.Config is older than your compiler version - probably nothing bad will happen - but you may wish to look for an update Boost version.  Define BOOST_CONFIG_SUPPRESS_OUTDATED_MESSAGE to suppress this message.
13786         [build CXX] workdir/UnpackedTarball/libetonyek/src/lib/IWAText.cpp
13787         Info: Boost.Config is older than your compiler version - probably nothing bad will happen - but you may wish to look for an update Boost version.  Define BOOST_CONFIG_SUPPRESS_OUTDATED_MESSAGE to suppress this message.
13788         [build CXX] workdir/UnpackedTarball/libetonyek/src/lib/IWORKChainedTokenizer.cpp
13789         [build CXX] workdir/UnpackedTarball/libetonyek/src/lib/IWORKChart.cpp
13790         [build CXX] workdir/UnpackedTarball/libetonyek/src/lib/IWORKCollector.cpp
13791         [build CXX] workdir/UnpackedTarball/libetonyek/src/lib/IWORKDictionary.cpp
13792 NEXT    0 new error (8 suppressed by D:/lode/dev/core/solenv/sanitizers/ui/modules/swriter.suppr)
13793         0 new warning (346 suppressed by D:/lode/dev/core/solenv/sanitizers/ui/modules/swriter.suppr)
13794 NEXT    0 new fatal (40 suppressed by D:/lode/dev/core/solenv/sanitizers/ui/modules/swriter.suppr)
13795         [build CXX] workdir/UnpackedTarball/libetonyek/src/lib/IWORKDiscardContext.cpp
13796         [build CXX] workdir/UnpackedTarball/libetonyek/src/lib/IWORKDocumentInterface.cpp
13797         Info: Boost.Config is older than your compiler version - probably nothing bad will happen - but you may wish to look for an update Boost version.  Define BOOST_CONFIG_SUPPRESS_OUTDATED_MESSAGE to suppress this message.
13798         Info: Boost.Config is older than your compiler version - probably nothing bad will happen - but you may wish to look for an update Boost version.  Define BOOST_CONFIG_SUPPRESS_OUTDATED_MESSAGE to suppress this message.
13799         Info: Boost.Config is older than your compiler version - probably nothing bad will happen - but you may wish to look for an update Boost version.  Define BOOST_CONFIG_SUPPRESS_OUTDATED_MESSAGE to suppress this message.

 Skipping 10398 Lines...

24197         [build CXX] sw/source/filter/ww8/WW8Sttbf.cxx
24198         [build CXX] sw/source/filter/ww8/WW8TableInfo.cxx
24199         [build CXX] sw/source/filter/ww8/fields.cxx
24200         [build CXX] sw/source/filter/ww8/styles.cxx
24201         [build CXX] sw/source/filter/ww8/writerhelper.cxx
24202         [build CXX] sw/source/filter/ww8/writerwordglue.cxx
24203         [build CXX] sw/source/filter/ww8/wrtw8esh.cxx
24204         [build CXX] sw/source/filter/ww8/wrtw8nds.cxx
24205         [build CXX] sw/source/filter/ww8/wrtw8num.cxx
24206         [build CXX] sw/source/filter/ww8/wrtw8sty.cxx
24207         [build CXX] sw/source/filter/ww8/wrtww8.cxx
24208         [build CXX] sw/source/filter/ww8/wrtww8gr.cxx
24209         [build CXX] sw/source/filter/ww8/ww8atr.cxx
24210         [build CXX] sw/source/filter/ww8/ww8glsy.cxx
24211         [build CXX] sw/source/filter/ww8/ww8graf.cxx
24212         [build CXX] sw/source/filter/ww8/ww8graf2.cxx
24213         [build CXX] sw/source/filter/ww8/ww8par.cxx
24214         [build CXX] sw/source/filter/ww8/ww8par2.cxx
24215         [build CXX] sw/source/filter/ww8/ww8par3.cxx
24216         [build CXX] sw/source/filter/ww8/ww8par4.cxx
24217         [build CXX] sw/source/filter/ww8/ww8par5.cxx
24218         [build CXX] sw/source/filter/ww8/ww8par6.cxx
24219         [build CXX] sw/source/filter/ww8/ww8scan.cxx
24220         [build CXX] sw/source/filter/ww8/ww8toolbar.cxx
24221         [build CXX] sw/source/ui/chrdlg/break.cxx
24222         [build CXX] sw/source/ui/chrdlg/chardlg.cxx
24223         [build CXX] sw/source/ui/chrdlg/drpcps.cxx
24224         [build CXX] sw/source/ui/chrdlg/numpara.cxx
24225         [build CXX] sw/source/ui/chrdlg/pardlg.cxx
24226         [build CXX] sw/source/ui/chrdlg/swuiccoll.cxx
24227         [build CXX] sw/source/ui/chrdlg/tblnumfm.cxx
24228 NEXT    D:/lode/dev/core/sw/source/filter/ww8/ww8scan.cxx(8445): error C2220: warning treated as error - no ´object´ file generated
24229         D:/lode/dev/core/sw/source/filter/ww8/ww8scan.cxx(8445): note: This diagnostic occurred in the compiler generated function ´WW8_FFN::WW8_FFN(const WW8_FFN &)´
24230         D:/lode/dev/core/sw/source/filter/ww8/ww8scan.cxx(8445): warning C4315: ´WW8_FFN´: ´this´ pointer for member ´WW8_FFN::sFontname´ may not be aligned 8 as expected by the constructor
24231         D:/lode/dev/core/sw/source/filter/ww8/ww8scan.cxx(8445): note: This diagnostic occurred in the compiler generated function ´WW8_FFN::WW8_FFN(const WW8_FFN &)´
24232         [build CXX] sw/source/ui/config/mailconfigpage.cxx
24233 NEXT    make[1]: *** [D:/lode/dev/core/solenv/gbuild/LinkTarget.mk:293: D:/lode/dev/core/workdir/CxxObject/sw/source/filter/ww8/ww8scan.o] Error 2
24234         make[1]: *** Waiting for unfinished jobs....
24235 NEXT    make: *** [Makefile:286: build] Error 2

No More Errors

Show full Log
Return to the MASTER Status Page