brief Build Log for tree: MASTER
Created at: Tue Jul 31 04:30
Show full Log
Return to the MASTER Status Page

Build Data

tinderbox: administrator: thb@documentfoundation.org
tinderbox: brief-log: 1533004201.27570.html
tinderbox: brieflog: https://tinderbox.libreoffice.org/cgi-bin/gunzip.cgi?tree=MASTER&brief-log=1533004201.27570
tinderbox: buildname: Win-x86_64_42
tinderbox: errorparser: unix
tinderbox: errors: 25
tinderbox: full-log: 1533004201.27570.html
tinderbox: fulllog: https://tinderbox.libreoffice.org/cgi-bin/gunzip.cgi?tree=MASTER&full-log=1533004201.27570
tinderbox: print: &nbsp; <a href=´http://cgit.freedesktop.org/libreoffice/core/log/?id=7e65a0794b7c57210779bb9a6d1f2b2e49eb86e9´>core</a>
tinderbox: starttime: 1532999238
tinderbox: status: build_failed
tinderbox: timenow: 1533003444
tinderbox: tree: MASTER

Pick an error message to see Log

End of Log File
configure: WARNING: --without-ucrt-dir not specified or MSUs not found - installer will have runtime dependency
* WARNING : --without-ucrt-dir not specified or MSUs not found - installer will have runtime dependency
/usr/bin/sh: D:/lode/dev/core/workdir/LinkTarget/Executable/concat-deps.exe: No such file or directory
a00521:116: warning: explicit link request to ´com::sun::star::uno::Sequence< E >´ could not be resolved
warning: tag INPUT: input source `/cygdrive/d/lode/dev/core/udkapi/org´ does not exist
0 new fatal (5 suppressed by D:/lode/dev/core/solenv/sanitizers/ui/modules/schart.suppr)
0 new fatal (12 suppressed by D:/lode/dev/core/solenv/sanitizers/ui/dbaccess.suppr)
0 new fatal (1 suppressed by D:/lode/dev/core/solenv/sanitizers/ui/modules/scanner.suppr)
0 new fatal (27 suppressed by D:/lode/dev/core/solenv/sanitizers/ui/cui.suppr)
0 new fatal (4 suppressed by D:/lode/dev/core/solenv/sanitizers/ui/formula.suppr)
0 new fatal (2 suppressed by D:/lode/dev/core/solenv/sanitizers/ui/fps.suppr)
0 new fatal (2 suppressed by D:/lode/dev/core/solenv/sanitizers/ui/modules/dbreport.suppr)
0 new fatal (1 suppressed by D:/lode/dev/core/solenv/sanitizers/ui/svt.suppr)
0 new error (17 suppressed by D:/lode/dev/core/solenv/sanitizers/ui/svx.suppr)
0 new fatal (19 suppressed by D:/lode/dev/core/solenv/sanitizers/ui/svx.suppr)
0 new error (3 suppressed by D:/lode/dev/core/solenv/sanitizers/ui/modules/simpress.suppr)
0 new fatal (5 suppressed by D:/lode/dev/core/solenv/sanitizers/ui/modules/simpress.suppr)
0 new fatal (2 suppressed by D:/lode/dev/core/solenv/sanitizers/ui/vcl.suppr)
0 new error (23 suppressed by D:/lode/dev/core/solenv/sanitizers/ui/modules/scalc.suppr)
0 new fatal (23 suppressed by D:/lode/dev/core/solenv/sanitizers/ui/modules/scalc.suppr)
0 new error (8 suppressed by D:/lode/dev/core/solenv/sanitizers/ui/modules/swriter.suppr)
0 new fatal (40 suppressed by D:/lode/dev/core/solenv/sanitizers/ui/modules/swriter.suppr)
D:/lode/dev/core/sw/source/filter/ww8/ww8scan.cxx(8445): error C2220: warning treated as error - no ´object´ file generated
make[1]: *** [D:/lode/dev/core/solenv/gbuild/LinkTarget.mk:293: D:/lode/dev/core/workdir/CxxObject/sw/source/filter/ww8/ww8scan.o] Error 2
make: *** [Makefile:286: build] Error 2



Build Log




 Skipping 68 Lines...

74            checking whether to enable pch feature... yes
75            checking the GNU Make version... D:/lode/opt/bin/make 4.2.1
76            checking whether GNU Make supports the ´file´ function... yes
77            checking for --hash-style gcc linker support... no 
78            checking for perl... /usr/bin/perl
79            checking the Perl version... Perl 5
80            checking for required Perl modules... all modules found
81            checking for Windows SDK... found Windows SDK 10.0 (/cygdrive/c/PROGRA~2/WINDOW~3/10)
82            checking for midl.exe... C:\Program Files (x86)\Windows Kits\10\/Bin/10.0.17134.0/x64/midl.exe
83            checking for csc.exe... C:\Windows\Microsoft.NET\Framework\v4.0.30319\/csc.exe
84            checking for al.exe... C:\Program Files\Microsoft SDKs\Windows\v7.1\Bin\NETFX 4.0 Tools\/al.exe
85            checking .NET Framework... found: C:/PROGRA~2/WINDOW~3/NETFXSDK/46D346~1.1/
86            checking whether to enable runtime optimizations... yes
87            checking valgrind/valgrind.h usability... no
88            checking valgrind/valgrind.h presence... no
89            checking for valgrind/valgrind.h... no
90            checking sys/sdt.h usability... no
91            checking sys/sdt.h presence... no
92            checking for sys/sdt.h... no
93            checking What the C++ library is... Microsoft
94            checking for gperf... /usr/bin/gperf
95            checking gperf version... OK
96            checking which libcmis to use... internal
97            checking whether C:/PROGRA~2/MIB055~1/2017/COMMUN~1/VC/Tools/MSVC/1414~1.264/bin/HostX64/x64/cl.exe supports C++11... yes
98            checking whether C:/PROGRA~2/MIB055~1/2017/COMMUN~1/VC/Tools/MSVC/1414~1.264/bin/HostX64/x64/cl.exe supports C++11 without Language Defect 757... yes
99            checking whether C:/PROGRA~2/MIB055~1/2017/COMMUN~1/VC/Tools/MSVC/1414~1.264/bin/HostX64/x64/cl.exe supports C++14 constexpr... yes
100           checking whether C:/PROGRA~2/MIB055~1/2017/COMMUN~1/VC/Tools/MSVC/1414~1.264/bin/HostX64/x64/cl.exe supports guaranteed copy elision... no
101           checking which memory allocator to use... internal
102           checking for posix_fallocate... no
103           checking whether to add custom build version... no
104           checking for C:/PROGRA~2/MIB055~1/2017/COMMUN~1/VC/redist/MSVC/14.14.26405/x64/Microsoft.VC141.CRT... checking for Microsoft_VC141_CRT_x86.msm Microsoft_VC150_CRT_x86.msm... checking for C:/PROGRA~2/MIB055~1/2017/COMMUN~1/VC/redist/MSVC/14.14.26405/MergeModules... C:/PROGRA~2/MIB055~1/2017/COMMUN~1/VC/redist/MSVC/14.14.26405/MergeModules/
105   NEXT    configure: WARNING: --without-ucrt-dir not specified or MSUs not found - installer will have runtime dependency
106           checking the installed JDK... checked (JDK 1.7.0_75)
107           checking for JAWT lib... jawt.lib
108           checking whether to enable export file validation... no, as Java is too old, need Java 8
109           checking for Microsoft Binary File Format Validator... no
110           checking which C preprocessor to use in idlc... ucpp

 Skipping 232 Lines...

342           config.status: creating config_host/config_options.h
343           config.status: config_host/config_options.h is unchanged
344           config.status: creating config_host/config_options_calc.h
345           config.status: config_host/config_options_calc.h is unchanged
346           config.status: creating config_host/config_typesizes.h
347           config.status: creating config_host/config_vendor.h
348           config.status: config_host/config_vendor.h is unchanged
349           config.status: creating config_host/config_vcl.h
350           config.status: config_host/config_vcl.h is unchanged
351           config.status: creating config_host/config_vclplug.h
352           config.status: config_host/config_vclplug.h is unchanged
353           config.status: creating config_host/config_version.h
354           config.status: config_host/config_version.h is unchanged
355           config.status: creating config_host/config_oauth2.h
356           config.status: config_host/config_oauth2.h is unchanged
357           config.status: creating config_host/config_poppler.h
358           config.status: config_host/config_poppler.h is unchanged
359           config.status: creating config_host/config_python.h
360           config.status: config_host/config_python.h is unchanged
361           config.status: creating config_host/config_writerperfect.h
362           config.status: config_host/config_writerperfect.h is unchanged
363           Language Configuration unchanged - avoiding scp2 stamp update
364           ****************************************************************************
365           
366           To build, run:
367           D:/lode/opt/bin/make
368           
369           To view some help, run:
370           D:/lode/opt/bin/make help
371           
372           *************************************
373   NEXT    * WARNING : --without-ucrt-dir not specified or MSUs not found - installer will have runtime dependency
374           [build CXX] soltools/mkdepend/collectdircontent.cxx
375           [build C  ] soltools/mkdepend/cppsetup.c
376           [build C  ] soltools/mkdepend/ifparser.c
377           [build C  ] soltools/mkdepend/include.c
378           [build C  ] soltools/mkdepend/main.c
379           [build C  ] soltools/mkdepend/parse.c
380           [build C  ] soltools/mkdepend/pr.c
381           [build C  ] solenv/bin/concat-deps.c
382           [build DEP] LNK:Executable/makedepend.exe
383           [build LNK] Executable/makedepend.exe
384   NEXT    /usr/bin/sh: D:/lode/dev/core/workdir/LinkTarget/Executable/concat-deps.exe: No such file or directory
385           [build LNK] Executable/concat-deps.exe
386           [build DEP] LNK:Executable/pdfverify.exe
387           [build DEP] LNK:CppunitTest/test_xmlsecurity_dialogs_test.dll
388           [build DEP] LNK:CppunitTest/test_xmlsecurity_pdfsigning.dll
389           [build DEP] LNK:CppunitTest/test_xmlsecurity_signing.dll

 Skipping 3241 Lines...

3630          [build CXX] sal/rtl/string.cxx
3631          [build CXX] sal/rtl/unload.cxx
3632          [build CXX] sal/rtl/uri.cxx
3633          [build CXX] sal/rtl/ustrbuf.cxx
3634          [build CXX] sal/rtl/ustring.cxx
3635          [build CXX] sal/rtl/uuid.cxx
3636          [build CXX] sal/textenc/converter.cxx
3637          [build CXX] sal/textenc/convertsimple.cxx
3638          [build CXX] sal/textenc/handleundefinedunicodetotextchar.cxx
3639          [build CXX] sal/textenc/tcvtutf8.cxx
3640          [build CXX] sal/textenc/tencinfo.cxx
3641          [build CXX] sal/textenc/textcvt.cxx
3642          [build CXX] sal/textenc/textenc.cxx
3643          [build CXX] sal/textenc/unichars.cxx
3644          [build CXX] sal/osl/w32/backtrace.cxx
3645          [build CXX] sal/osl/w32/conditn.cxx
3646          [build CXX] sal/osl/w32/dllentry.cxx
3647          [build CXX] sal/osl/w32/file.cxx
3648          [build CXX] sal/osl/w32/file_dirvol.cxx
3649          [build CXX] sal/osl/w32/file_error.cxx
3650          [build CXX] sal/osl/w32/file_url.cxx
3651          [build CXX] sal/osl/w32/interlck.cxx
3652          [build CXX] sal/osl/w32/memory.cxx
3653          [build CXX] sal/osl/w32/module.cxx
3654          [build CXX] sal/osl/w32/mutex.cxx
3655          [build CXX] sal/osl/w32/nlsupport.cxx
3656          [build CXX] sal/osl/w32/path_helper.cxx
3657          [build CXX] sal/osl/w32/pipe.cxx
3658          [build CXX] sal/osl/w32/process.cxx
3659          [build CXX] sal/osl/w32/procimpl.cxx
3660          [build CXX] sal/osl/w32/profile.cxx
3661  NEXT    a00521:116: warning: explicit link request to ´com::sun::star::uno::Sequence< E >´ could not be resolved
3662          [build CXX] sal/osl/w32/random.cxx
3663          [build CXX] sal/osl/w32/salinit.cxx
3664          [build CXX] sal/osl/w32/security.cxx
3665          [build CXX] sal/osl/w32/signal.cxx
3666          [build CXX] sal/osl/w32/socket.cxx

 Skipping 3793 Lines...

7459          [build C  ] UnpackedTarball/neon/src/ne_sspi.c
7460          [build MOD] openssl
7461          cl : Command line warning D9025 : overriding ´/W4´ with ´/w´
7462          [build DEP] LNK:StaticLibrary/ulingu.lib
7463          cl : Command line warning D9025 : [build LNK] StaticLibrary/ulingu.lib
7464          overriding ´/W4´ with ´/w´
7465          cl : Command line warning D9025 : overriding ´/W4´ with ´/w´
7466          cl : Command line warning D9025 : overriding ´/W4´ with ´/w´
7467          [build CXX] ucb/source/ucp/expand/ucpexpand.cxx
7468          [build DEP] LNK:StaticLibrary/vclmain.lib
7469          [build LNK] StaticLibrary/vclmain.lib
7470          [build CXX] l10ntools/source/helper.cxx
7471          [build CXX] l10ntools/source/common.cxx
7472          [build CXX] l10ntools/source/merge.cxx
7473          [build CXX] l10ntools/source/po.cxx
7474          [build CXX] l10ntools/source/helpex.cxx
7475          [build CXX] l10ntools/source/xmlparse.cxx
7476          [build CXX] l10ntools/source/helpmerge.cxx
7477          [build CXX] workdir/LexTarget/l10ntools/source/cfglex.cxx
7478          [build CXX] l10ntools/source/cfgmerge.cxx
7479          [build CXX] workdir/LexTarget/l10ntools/source/xrmlex.cxx
7480          [build CXX] l10ntools/source/xrmmerge.cxx
7481          [build CXX] l10ntools/source/localize.cxx
7482          [build CXX] l10ntools/source/pocheck.cxx
7483          [build CXX] l10ntools/source/propmerge.cxx
7484          [build CXX] l10ntools/source/propex.cxx
7485          [build CXX] l10ntools/source/treemerge.cxx
7486          [build CXX] l10ntools/source/treex.cxx
7487          [build GEN] CustomTarget/odk/docs/idl/doxygen.log
7488          [build MOD] offapi
7489          [build BIN] oovbaapi
7490  NEXT    warning: tag INPUT: input source `/cygdrive/d/lode/dev/core/udkapi/org´ does not exist
7491          [build CUS] sfx2/classification
7492          [build CXX] testtools/source/bridgetest/cppobj.cxx
7493          [build CXX] testtools/source/bridgetest/bridgetest.cxx
7494          [build BIN] xmlreader
7495          [build UPK] Python-3.5.5.tar.xz

 Skipping 6178 Lines...

13673         [build JAR] ScriptProviderForJavaScript
13674         D:/lode/dev/core/workdir/UnpackedTarball/rasqal/src\rasqal.h(1835): warning C4115: ´timeval´: named type definition in parentheses
13675         [build BIN] wizards
13676         [build DEP] LNK:CppunitTest/test_officecfg_cppheader_test.dll
13677         [build LNK] CppunitTest/test_officecfg_cppheader_test.dll
13678         D:/lode/dev/core/workdir/UnpackedTarball/rasqal/src\rasqal.h(1835): warning C4115: ´timeval´: named type definition in parentheses
13679         [build PAT] gpgmepp
13680            Creating library D:/lode/dev/core/workdir/LinkTarget/CppunitTest/itest_officecfg_cppheader_test.lib and object D:/lode/dev/core/workdir/LinkTarget/CppunitTest/itest_officecfg_cppheader_test.exp
13681         [build MOD] libassuan
13682         [build PAT] libebook
13683         [build PKG] liblangtag_data
13684         [build DEP] LNK:Library/librdf.dll
13685         [build LNK] Library/librdf.dll
13686         [build XCD] registry_en-US
13687         [build LOC] extras
13688         [build MOD] readlicense_oo
13689         [build MOD] wizards
13690         [build PKG] python3
13691         [build EPK] liblangtag_data
13692         [build CXX] i18nlangtag/source/isolang/insys.cxx
13693         [build CXX] i18nlangtag/source/isolang/isolang.cxx
13694         [build CXX] i18nlangtag/source/isolang/mslangid.cxx
13695         [build CXX] i18nlangtag/source/languagetag/languagetag.cxx
13696         [build CXX] i18nlangtag/source/languagetag/languagetagicu.cxx
13697         [build UIA] modules/BasicIDE
13698         [build UIA] modules/schart
13699            Creating library D:/lode/dev/core/workdir/LinkTarget/Library/librdf.lib and object D:/lode/dev/core/workdir/LinkTarget/Library/librdf.exp
13700         [build UIA] cui
13701         0 new warning (8 suppressed by D:/lode/dev/core/solenv/sanitizers/ui/modules/BasicIDE.suppr)
13702         [build UIA] dbaccess
13703         0 new warning (83 suppressed by D:/lode/dev/core/solenv/sanitizers/ui/modules/schart.suppr)
13704 NEXT    0 new fatal (5 suppressed by D:/lode/dev/core/solenv/sanitizers/ui/modules/schart.suppr)
13705         [build UIA] modules/dbapp
13706         0 new warning (138 suppressed by D:/lode/dev/core/solenv/sanitizers/ui/dbaccess.suppr)
13707 NEXT    0 new fatal (12 suppressed by D:/lode/dev/core/solenv/sanitizers/ui/dbaccess.suppr)
13708         [build UIA] modules/dbbrowser
13709         [build UIA] modules/dbquery
13710         [build UIA] modules/dbrelation
13711         [build UIA] modules/dbtable
13712         [build UIA] modules/dbtdata
13713         [build UIA] desktop
13714         [build UIA] editeng
13715         [build UIA] modules/sabpilot
13716         [build UIA] modules/scanner
13717         [build UIA] modules/sbibliography
13718         0 new warning (23 suppressed by D:/lode/dev/core/solenv/sanitizers/ui/desktop.suppr)
13719         [build UIA] modules/spropctrlr
13720         [build UIA] filter
13721         0 new warning (43 suppressed by D:/lode/dev/core/solenv/sanitizers/ui/modules/sabpilot.suppr)
13722         0 new warning (10 suppressed by D:/lode/dev/core/solenv/sanitizers/ui/modules/scanner.suppr)
13723 NEXT    0 new fatal (1 suppressed by D:/lode/dev/core/solenv/sanitizers/ui/modules/scanner.suppr)
13724         [build UIA] formula
13725         [build UIA] fps
13726         0 new warning (3 suppressed by D:/lode/dev/core/solenv/sanitizers/ui/modules/spropctrlr.suppr)
13727         0 new warning (37 suppressed by D:/lode/dev/core/solenv/sanitizers/ui/modules/sbibliography.suppr)
13728         [build UIA] modules/StartModule
13729         0 new warning (521 suppressed by D:/lode/dev/core/solenv/sanitizers/ui/cui.suppr)
13730 NEXT    0 new fatal (27 suppressed by D:/lode/dev/core/solenv/sanitizers/ui/cui.suppr)
13731         0 new warning (17 suppressed by D:/lode/dev/core/solenv/sanitizers/ui/formula.suppr)
13732 NEXT    0 new fatal (4 suppressed by D:/lode/dev/core/solenv/sanitizers/ui/formula.suppr)
13733         0 new warning (27 suppressed by D:/lode/dev/core/solenv/sanitizers/ui/filter.suppr)
13734         [build UIA] modules/dbreport
13735         [build UIA] modules/scalc
13736         [build UIA] modules/sdraw
13737         [build UIA] modules/simpress
13738         [build UIA] sfx
13739         0 new warning (11 suppressed by D:/lode/dev/core/solenv/sanitizers/ui/fps.suppr)
13740 NEXT    0 new fatal (2 suppressed by D:/lode/dev/core/solenv/sanitizers/ui/fps.suppr)
13741         0 new warning (12 suppressed by D:/lode/dev/core/solenv/sanitizers/ui/modules/dbreport.suppr)
13742 NEXT    0 new fatal (2 suppressed by D:/lode/dev/core/solenv/sanitizers/ui/modules/dbreport.suppr)
13743         [build UIA] modules/smath
13744         [build UIA] svt
13745         0 new warning (10 suppressed by D:/lode/dev/core/solenv/sanitizers/ui/modules/sdraw.suppr)
13746         [build UIA] svx
13747         0 new warning (90 suppressed by D:/lode/dev/core/solenv/sanitizers/ui/sfx.suppr)
13748         [build UIA] modules/sglobal
13749         0 new warning (27 suppressed by D:/lode/dev/core/solenv/sanitizers/ui/svt.suppr)
13750 NEXT    0 new fatal (1 suppressed by D:/lode/dev/core/solenv/sanitizers/ui/svt.suppr)
13751         [build UIA] modules/sweb
13752         0 new warning (41 suppressed by D:/lode/dev/core/solenv/sanitizers/ui/modules/smath.suppr)
13753         [build UIA] modules/swform
13754         [build UIA] modules/swreport
13755         [build UIA] modules/swriter
13756         [build UIA] modules/swxform
13757         [build UIA] uui
13758         [build UIA] vcl
13759         [build UIA] writerperfect
13760 NEXT    0 new error (17 suppressed by D:/lode/dev/core/solenv/sanitizers/ui/svx.suppr)
13761         0 new warning (149 suppressed by D:/lode/dev/core/solenv/sanitizers/ui/svx.suppr)
13762 NEXT    0 new fatal (19 suppressed by D:/lode/dev/core/solenv/sanitizers/ui/svx.suppr)
13763         [build UIA] xmlsec
13764         0 new warning (20 suppressed by D:/lode/dev/core/solenv/sanitizers/ui/uui.suppr)
13765         0 new warning (2 suppressed by D:/lode/dev/core/solenv/sanitizers/ui/writerperfect.suppr)
13766         [build VAL] CustomTarget/writerfilter/source/ooxml/model.validated
13767         [build CXX] workdir/UnpackedTarball/libetonyek/src/lib/EtonyekDocument.cpp
13768 NEXT    0 new error (3 suppressed by D:/lode/dev/core/solenv/sanitizers/ui/modules/simpress.suppr)
13769         0 new warning (70 suppressed by D:/lode/dev/core/solenv/sanitizers/ui/modules/simpress.suppr)
13770 NEXT    0 new fatal (5 suppressed by D:/lode/dev/core/solenv/sanitizers/ui/modules/simpress.suppr)
13771         0 new warning (63 suppressed by D:/lode/dev/core/solenv/sanitizers/ui/xmlsec.suppr)
13772         [build CXX] workdir/UnpackedTarball/libetonyek/src/lib/IWAField.cpp
13773         [build CXX] workdir/UnpackedTarball/libetonyek/src/lib/IWAMessage.cpp
13774         0 new warning (53 suppressed by D:/lode/dev/core/solenv/sanitizers/ui/vcl.suppr)
13775 NEXT    0 new fatal (2 suppressed by D:/lode/dev/core/solenv/sanitizers/ui/vcl.suppr)
13776         [build CXX] workdir/UnpackedTarball/libetonyek/src/lib/IWAObjectIndex.cpp
13777         [build CXX] workdir/UnpackedTarball/libetonyek/src/lib/IWAParser.cpp
13778         Info: Boost.Config is older than your compiler version - probably nothing bad will happen - but you may wish to look for an update Boost version.  Define BOOST_CONFIG_SUPPRESS_OUTDATED_MESSAGE to suppress this message.
13779         Info: Boost.Config is older than your compiler version - probably nothing bad will happen - but you may wish to look for an update Boost version.  Define BOOST_CONFIG_SUPPRESS_OUTDATED_MESSAGE to suppress this message.
13780         Info: Boost.Config is older than your compiler version - probably nothing bad will happen - but you may wish to look for an update Boost version.  Define BOOST_CONFIG_SUPPRESS_OUTDATED_MESSAGE to suppress this message.
13781 NEXT    0 new error (23 suppressed by D:/lode/dev/core/solenv/sanitizers/ui/modules/scalc.suppr)
13782         0 new warning (238 suppressed by D:/lode/dev/core/solenv/sanitizers/ui/modules/scalc.suppr)
13783 NEXT    0 new fatal (23 suppressed by D:/lode/dev/core/solenv/sanitizers/ui/modules/scalc.suppr)
13784         [build CXX] workdir/UnpackedTarball/libetonyek/src/lib/IWAReader.cpp
13785         [build CXX] workdir/UnpackedTarball/libetonyek/src/lib/IWASnappyStream.cpp
13786         Info: Boost.Config is older than your compiler version - probably nothing bad will happen - but you may wish to look for an update Boost version.  Define BOOST_CONFIG_SUPPRESS_OUTDATED_MESSAGE to suppress this message.
13787         [build CXX] workdir/UnpackedTarball/libetonyek/src/lib/IWAText.cpp
13788         Info: Boost.Config is older than your compiler version - probably nothing bad will happen - but you may wish to look for an update Boost version.  Define BOOST_CONFIG_SUPPRESS_OUTDATED_MESSAGE to suppress this message.
13789         Info: Boost.Config is older than your compiler version - probably nothing bad will happen - but you may wish to look for an update Boost version.  Define BOOST_CONFIG_SUPPRESS_OUTDATED_MESSAGE to suppress this message.
13790         Info: Boost.Config is older than your compiler version - probably nothing bad will happen - but you may wish to look for an update Boost version.  Define BOOST_CONFIG_SUPPRESS_OUTDATED_MESSAGE to suppress this message.
13791         [build CXX] workdir/UnpackedTarball/libetonyek/src/lib/IWORKChainedTokenizer.cpp
13792         [build CXX] workdir/UnpackedTarball/libetonyek/src/lib/IWORKChart.cpp
13793 NEXT    0 new error (8 suppressed by D:/lode/dev/core/solenv/sanitizers/ui/modules/swriter.suppr)
13794         0 new warning (346 suppressed by D:/lode/dev/core/solenv/sanitizers/ui/modules/swriter.suppr)
13795 NEXT    0 new fatal (40 suppressed by D:/lode/dev/core/solenv/sanitizers/ui/modules/swriter.suppr)
13796         [build CXX] workdir/UnpackedTarball/libetonyek/src/lib/IWORKCollector.cpp
13797         [build CXX] workdir/UnpackedTarball/libetonyek/src/lib/IWORKDictionary.cpp
13798         [build CXX] workdir/UnpackedTarball/libetonyek/src/lib/IWORKDiscardContext.cpp
13799         [build CXX] workdir/UnpackedTarball/libetonyek/src/lib/IWORKDocumentInterface.cpp
13800         Info: Boost.Config is older than your compiler version - probably nothing bad will happen - but you may wish to look for an update Boost version.  Define BOOST_CONFIG_SUPPRESS_OUTDATED_MESSAGE to suppress this message.

 Skipping 10393 Lines...

24193         [build CXX] sw/source/filter/ww8/WW8FibData.cxx
24194         [build CXX] sw/source/filter/ww8/WW8Sttbf.cxx
24195         [build CXX] sw/source/filter/ww8/WW8TableInfo.cxx
24196         [build CXX] sw/source/filter/ww8/fields.cxx
24197         [build CXX] sw/source/filter/ww8/styles.cxx
24198         [build CXX] sw/source/filter/ww8/writerhelper.cxx
24199         [build CXX] sw/source/filter/ww8/writerwordglue.cxx
24200         [build CXX] sw/source/filter/ww8/wrtw8esh.cxx
24201         [build CXX] sw/source/filter/ww8/wrtw8nds.cxx
24202         [build CXX] sw/source/filter/ww8/wrtw8num.cxx
24203         [build CXX] sw/source/filter/ww8/wrtw8sty.cxx
24204         [build CXX] sw/source/filter/ww8/wrtww8.cxx
24205         [build CXX] sw/source/filter/ww8/wrtww8gr.cxx
24206         [build CXX] sw/source/filter/ww8/ww8atr.cxx
24207         [build CXX] sw/source/filter/ww8/ww8glsy.cxx
24208         [build CXX] sw/source/filter/ww8/ww8graf.cxx
24209         [build CXX] sw/source/filter/ww8/ww8graf2.cxx
24210         [build CXX] sw/source/filter/ww8/ww8par.cxx
24211         [build CXX] sw/source/filter/ww8/ww8par2.cxx
24212         [build CXX] sw/source/filter/ww8/ww8par3.cxx
24213         [build CXX] sw/source/filter/ww8/ww8par4.cxx
24214         [build CXX] sw/source/filter/ww8/ww8par5.cxx
24215         [build CXX] sw/source/filter/ww8/ww8par6.cxx
24216         [build CXX] sw/source/filter/ww8/ww8scan.cxx
24217         [build CXX] sw/source/filter/ww8/ww8toolbar.cxx
24218         [build CXX] sw/source/ui/chrdlg/break.cxx
24219         [build CXX] sw/source/ui/chrdlg/chardlg.cxx
24220         [build CXX] sw/source/ui/chrdlg/drpcps.cxx
24221         [build CXX] sw/source/ui/chrdlg/numpara.cxx
24222         [build CXX] sw/source/ui/chrdlg/pardlg.cxx
24223         [build CXX] sw/source/ui/chrdlg/swuiccoll.cxx
24224 NEXT    D:/lode/dev/core/sw/source/filter/ww8/ww8scan.cxx(8445): error C2220: warning treated as error - no ´object´ file generated
24225         D:/lode/dev/core/sw/source/filter/ww8/ww8scan.cxx(8445): note: This diagnostic occurred in the compiler generated function ´WW8_FFN::WW8_FFN(const WW8_FFN &)´
24226         D:/lode/dev/core/sw/source/filter/ww8/ww8scan.cxx(8445): warning C4315: ´WW8_FFN´: ´this´ pointer for member ´WW8_FFN::sFontname´ may not be aligned 8 as expected by the constructor
24227         D:/lode/dev/core/sw/source/filter/ww8/ww8scan.cxx(8445): note: This diagnostic occurred in the compiler generated function ´WW8_FFN::WW8_FFN(const WW8_FFN &)´
24228         [build CXX] sw/source/ui/chrdlg/tblnumfm.cxx
24229         [build CXX] sw/source/ui/config/mailconfigpage.cxx
24230 NEXT    make[1]: *** [D:/lode/dev/core/solenv/gbuild/LinkTarget.mk:293: D:/lode/dev/core/workdir/CxxObject/sw/source/filter/ww8/ww8scan.o] Error 2
24231         make[1]: *** Waiting for unfinished jobs....
24232 NEXT    make: *** [Makefile:286: build] Error 2

No More Errors

Show full Log
Return to the MASTER Status Page