brief Build Log for tree: MASTER
Created at: Tue Sep 25 12:27
Show full Log
Return to the MASTER Status Page

Build Data

tinderbox: administrator: jenkins
tinderbox: brief-log: 1537871271.4910.html
tinderbox: brieflog: https://tinderbox.libreoffice.org/cgi-bin/gunzip.cgi?tree=MASTER&brief-log=1537871271.4910
tinderbox: buildname: Jenkins_Windows_Dbg
tinderbox: errorparser: unix
tinderbox: errors: 6
tinderbox: full-log: 1537871271.4910.html
tinderbox: fulllog: https://tinderbox.libreoffice.org/cgi-bin/gunzip.cgi?tree=MASTER&full-log=1537871271.4910
tinderbox: print: &nbsp; <a title="jenkins build" href="http://ci.libreoffice.org/job/lo_tb_master_win_dbg/18608/">jenkins on tb73</a>&nbsp; <a title="core" href="http://cgit.freedesktop.org/libreoffice/core/log/?id=88e26267844ac96f39d341ef05bd1536f210af74">core</a>
tinderbox: starttime: 1537870924
tinderbox: status: build_failed
tinderbox: timenow: 1537871265
tinderbox: tree: MASTER

Pick an error message to see Log

End of Log File
equality assertion failed
C:/cygwin/home/tdf/lode/jenkins/workspace/lo_tb_master_win_dbg/vcl/qa/cppunit/complextext.cxx(98) : error : Assertion
equality assertion failed
Error: a unit test failed, please do one of:
make[1]: *** [C:/cygwin/home/tdf/lode/jenkins/workspace/lo_tb_master_win_dbg/solenv/gbuild/CppunitTest.mk:121: C:/cygwin/home/tdf/lode/jenkins/workspace/lo_tb_master_win_dbg/workdir/CppunitTest/vcl_complextext.test] Error 1
make: *** [Makefile:286: build] Error 2



Build Log




 Skipping 828 Lines...

835           [build CUT] chart2_export
836           [build CUT] chart2_import
837           [build CUT] chart2_trendcalculators
838           [build CUT] chart2_dump
839           [build CUT] chart2_pivot_chart_test
840           [build CUT] chart2_xshape
841           [build CUT] drawinglayer_border
842           [build CUT] sc_cond_format_merge
843           [build CUT] sc_new_cond_format_api
844           [build CUT] sc_subsequent_filters_test
845           [build CUT] sc_subsequent_export_test
846           [build CUT] sc_html_export_test
847           [build CUT] sc_copypaste
848           [build CUT] sc_pivottable_filters_test
849           [build CUT] sc_functions_test_old
850           [build CUT] sc_database_functions_test
851           [build CUT] sc_array_functions_test
852           [build CUT] sc_addin_functions_test
853           [build CUT] sc_datetime_functions_test
854           [build CUT] sc_financial_functions_test
855           [build CUT] sc_information_functions_test
856           [build CUT] sc_logical_functions_test
857           [build CUT] sc_mathematical_functions_test
858           [build CUT] sc_spreadsheet_functions_test
859           [build CUT] sc_statistical_functions_test
860           [build CUT] sc_text_functions_test
861           [build CUT] sd_uimpress
862           [build CUT] sd_import_tests
863           [build CUT] sd_import_tests_smartart
864           `anonymous namespace´::CanvasBitmapTest::runTest finished in: 6449ms
865           C:/cygwin/home/tdf/lode/jenkins/workspace/lo_tb_master_win_dbg/vcl/qa/cppunit/complextext.cxx:98:VclComplexTextTest::testArabic
866   NEXT    equality assertion failed
867           - Expected: 72
868           - Actual  : 75
869           
870           VclComplexTextTest::testArabic finished in: 744ms
871           VclComplexTextTest::testTdf95650 finished in: 1505ms
872   NEXT    C:/cygwin/home/tdf/lode/jenkins/workspace/lo_tb_master_win_dbg/vcl/qa/cppunit/complextext.cxx(98) : error : Assertion
873           Test name: VclComplexTextTest::testArabic
874   NEXT    equality assertion failed
875           - Expected: 72
876           - Actual  : 75
877           
878           Failures !!!
879           Run: 3   Failure total: 1   Failures: 1   Errors: 0
880           
881   NEXT    Error: a unit test failed, please do one of:
882           make CppunitTest_vcl_complextext CPPUNITTRACE=TRUE # which is a shortcut for the following line
883           make CppunitTest_vcl_complextext CPPUNITTRACE="´C:/Program Files (x86)/Microsoft Visual Studio/2017/Community/Common7/IDE/devenv.exe´ /debugexe" # for interactive debugging in Visual Studio
884           make CppunitTest_vcl_complextext CPPUNITTRACE="drmemory -free_max_frames 20" # for memory checking (install Dr.Memory first, and put it to your PATH)
885           
886           You can limit the execution to just one particular test by:
887           
888           make CppunitTest_vcl_complextext CPPUNIT_TEST_NAME="testXYZ" ...above mentioned params...
889           
890   NEXT    make[1]: *** [C:/cygwin/home/tdf/lode/jenkins/workspace/lo_tb_master_win_dbg/solenv/gbuild/CppunitTest.mk:121: C:/cygwin/home/tdf/lode/jenkins/workspace/lo_tb_master_win_dbg/workdir/CppunitTest/vcl_complextext.test] Error 1
891           make[1]: *** Waiting for unfinished jobs....
892   NEXT    make: *** [Makefile:286: build] Error 2

No More Errors

Show full Log
Return to the MASTER Status Page