brief Build Log for tree: MASTER
Created at: Wed Sep 26 10:12
Show full Log
Return to the MASTER Status Page

Build Data

tinderbox: administrator: jenkins
tinderbox: brief-log: 1537949563.7757.html
tinderbox: brieflog: https://tinderbox.libreoffice.org/cgi-bin/gunzip.cgi?tree=MASTER&brief-log=1537949563.7757
tinderbox: buildname: Jenkins_Windows
tinderbox: errorparser: unix
tinderbox: errors: 6
tinderbox: full-log: 1537949563.7757.html
tinderbox: fulllog: https://tinderbox.libreoffice.org/cgi-bin/gunzip.cgi?tree=MASTER&full-log=1537949563.7757
tinderbox: print: &nbsp; <a title="jenkins build" href="http://ci.libreoffice.org/job/lo_tb_master_win/19018/">jenkins on tb73</a>&nbsp; <a title="core" href="http://cgit.freedesktop.org/libreoffice/core/log/?id=8913a08423e732f27ae7645cad9570aadb5aaf2b">core</a>
tinderbox: starttime: 1537949457
tinderbox: status: build_failed
tinderbox: timenow: 1537949553
tinderbox: tree: MASTER

Pick an error message to see Log

End of Log File
equality assertion failed
C:/cygwin/home/tdf/lode/jenkins/workspace/lo_tb_master_win/vcl/qa/cppunit/complextext.cxx(98) : error : Assertion
equality assertion failed
Error: a unit test failed, please do one of:
make[1]: *** [C:/cygwin/home/tdf/lode/jenkins/workspace/lo_tb_master_win/solenv/gbuild/CppunitTest.mk:120: C:/cygwin/home/tdf/lode/jenkins/workspace/lo_tb_master_win/workdir/CppunitTest/vcl_complextext.test] Error 1
make: *** [Makefile:286: build] Error 2



Build Log




 Skipping 803 Lines...

810           [build CUT] vcl_timer
811           [build CUT] vcl_blocklistparser_test
812           [build CUT] writerperfect_stream
813           [build CUT] xmloff_uxmloff
814           [build CUT] drawinglayer_border
815           [build CUT] unoxml_domtest
816           [build CHK] configmgr
817           [build CHK] connectivity
818           [build CHK] desktop
819           [build CHK] editeng
820           [build CHK] emfio
821           [build CHK] extensions
822           [build CHK] filter
823           [build CHK] hwpfilter
824           [build CHK] i18npool
825           [build CHK] registry
826           [build CHK] sax
827           [build CHK] sdext
828           [build CHK] svgio
829           [build CHK] svl
830           [build CHK] tools
831           [build CHK] ucb
832           [build CHK] unotools
833           [build CHK] xmloff
834           [build CHK] basic
835           [build SLC] unoxml
836           [build SLC] drawinglayer
837           [build CHK] sot
838           [build CHK] lotuswordpro
839           `anonymous namespace´::CanvasBitmapTest::runTest finished in: 998ms
840           C:/cygwin/home/tdf/lode/jenkins/workspace/lo_tb_master_win/vcl/qa/cppunit/complextext.cxx:98:VclComplexTextTest::testArabic
841   NEXT    equality assertion failed
842           - Expected: 72
843           - Actual  : 75
844           
845           VclComplexTextTest::testArabic finished in: 880ms
846           VclComplexTextTest::testTdf95650 finished in: 178ms
847   NEXT    C:/cygwin/home/tdf/lode/jenkins/workspace/lo_tb_master_win/vcl/qa/cppunit/complextext.cxx(98) : error : Assertion
848           Test name: VclComplexTextTest::testArabic
849   NEXT    equality assertion failed
850           - Expected: 72
851           - Actual  : 75
852           
853           Failures !!!
854           Run: 3   Failure total: 1   Failures: 1   Errors: 0
855           
856   NEXT    Error: a unit test failed, please do one of:
857           make CppunitTest_vcl_complextext CPPUNITTRACE=TRUE # which is a shortcut for the following line
858           make CppunitTest_vcl_complextext CPPUNITTRACE="´C:/Program Files (x86)/Microsoft Visual Studio/2017/Community/Common7/IDE/devenv.exe´ /debugexe" # for interactive debugging in Visual Studio
859           make CppunitTest_vcl_complextext CPPUNITTRACE="drmemory -free_max_frames 20" # for memory checking (install Dr.Memory first, and put it to your PATH)
860           
861           You can limit the execution to just one particular test by:
862           
863           make CppunitTest_vcl_complextext CPPUNIT_TEST_NAME="testXYZ" ...above mentioned params...
864           
865   NEXT    make[1]: *** [C:/cygwin/home/tdf/lode/jenkins/workspace/lo_tb_master_win/solenv/gbuild/CppunitTest.mk:120: C:/cygwin/home/tdf/lode/jenkins/workspace/lo_tb_master_win/workdir/CppunitTest/vcl_complextext.test] Error 1
866           make[1]: *** Waiting for unfinished jobs....
867   NEXT    make: *** [Makefile:286: build] Error 2

No More Errors

Show full Log
Return to the MASTER Status Page